Target
Phospholipase A2
Ligand
BDBM50263002
Substrate
Meas. Tech.
ChEMBL_489269 (CHEMBL990825)
IC50
160±n/a nM
Citation
 Oslund, RCCermak, NGelb, MH Highly specific and broadly potent inhibitors of mammalian secreted phospholipases A2. J Med Chem 51:4708-14 (2008)  
Target
Name:
Phospholipase A2
Synonyms:
PA21B_MOUSE Pla2 | Pla2g1b
Type:
PROTEIN
Mol. Mass.:
16291.94
Organism:
Mus musculus
Description:
ChEMBL_489269
Residue:
146
  
Inhibitor
Name:
BDBM50263002
Synonyms:
(2-amino-2-oxoacetyl)-1-benzyl-2-ethyl-1H-6,7-benzoindol-4-yloxy)acetate | CHEMBL515637
Type:
Small organic molecule
Emp. Form.:
C25H22N2O5
Mol. Mass.:
430.4526
SMILES:
CCc1c(C(=O)C(N)=O)c2c(OCC(O)=O)cc3ccccc3c2n1Cc1ccccc1
: