Target
Fibroblast growth factor receptor 1
Ligand
BDBM50263015
Substrate
Meas. Tech.
ChEMBL_489726 (CHEMBL986501)
IC50
560±n/a nM
Citation
 Lin, LGXie, HLi, HLTong, LJTang, CPKe, CQLiu, QFLin, LPGeng, MYJiang, HZhao, WMDing, JYe, Y Naturally occurring homoisoflavonoids function as potent protein tyrosine kinase inhibitors by c-Src-based high-throughput screening. J Med Chem 51:4419-29 (2008)  
Target
Name:
Fibroblast growth factor receptor 1
Synonyms:
BFGFR Basic fibroblast growth factor receptor 1 (FGFR1) CEK FGFR-1 FGFR-1, (FL) FGFR1_HUMAN FLT2 Fibroblast growth factor receptor 1 (FGFR-1) Fms-like tyrosine kinase 2 N-sam bFGF-R | c-fgr
Type:
Receptor
Mol. Mass.:
91861.70
Organism:
Homo sapiens (Human)
Description:
P11362
Residue:
822
  
Inhibitor
Name:
BDBM50263015
Synonyms:
CHEMBL478611 | epihematoxylol
Type:
Small organic molecule
Emp. Form.:
C16H16O7
Mol. Mass.:
320.294
SMILES:
O[C@@H]1c2ccc(O)c(O)c2OC[C@]1(O)Cc1ccc(O)c(O)c1
: