Target
Mitogen-activated protein kinase 14
Ligand
BDBM50263022
Substrate
Meas. Tech.
ChEMBL_490152 (CHEMBL983811)
Ki
25±n/a nM
Citation
 Angell, RAston, NMBamborough, PBuckton, JBCockerill, SdeBoeck, SJEdwards, CDHolmes, DSJones, KLLaine, DIPatel, SSmee, PASmith, KJSomers, DOWalker, AL Biphenyl amide p38 kinase inhibitors 3: Improvement of cellular and in vivo activity. Bioorg Med Chem Lett 18:4428-32 (2008)  
Target
Name:
Mitogen-activated protein kinase 14
Synonyms:
CSAID-binding protein CSBP1 CSPB1 MAP kinase 14 MAP kinase p38 alpha MAPK14 MK14_HUMAN Mitogen-activated protein kinase p38 alpha Stress-activated protein kinase 2a | p38 MAP kinase alpha/beta
Type:
Serine/threonine-protein kinase
Mol. Mass.:
41286.76
Organism:
Homo sapiens (Human)
Description:
Q16539
Residue:
360
  
Inhibitor
Name:
BDBM50263022
Synonyms:
6-Chloro-biphenyl-3,4'-dicarboxylic acid 3-cyclopropylamide 4'-cyclopropylmethyl-amide | CHEMBL479039
Type:
Small organic molecule
Emp. Form.:
C21H21ClN2O2
Mol. Mass.:
368.857
SMILES:
Clc1ccc(cc1-c1ccc(cc1)C(=O)NCC1CC1)C(=O)NC1CC1
: