Target
Potassium voltage-gated channel subfamily H member 2
Ligand
BDBM50263110
Substrate
Meas. Tech.
ChEMBL_490606 (CHEMBL984727)
IC50
>32000±n/a nM
Citation
 Finlay, MRActon, DGAndrews, DMBarker, AJDennis, MFisher, EGraham, MAGreen, CPHeaton, DWKaroutchi, GLoddick, SAMorgentin, RRoberts, ATucker, JAWeir, HM Imidazole piperazines: SAR and development of a potent class of cyclin-dependent kinase inhibitors with a novel binding mode. Bioorg Med Chem Lett 18:4442-6 (2008)  
Target
Name:
Potassium voltage-gated channel subfamily H member 2
Synonyms:
1,3-beta-glucan synthase component GLS2 ERG Eag-related protein 1 Ether-a-go-go-related gene (HERG) Ether-a-go-go-related gene potassium channel 1 Ether-a-go-go-related gene potassium channel 1 (hERG1) Ether-a-go-go-related protein 1 H-ERG KCNH2 Potassium voltage-gated channel subfamily H member 2 (hERG) Voltage-gated potassium channel subunit Kv11.1 hERG Potassium Channel 1 | putative potassium channel subunit
Type:
Multi-pass membrane protein
Mol. Mass.:
126672.65
Organism:
Homo sapiens (Human)
Description:
Q12809
Residue:
1159
  
Inhibitor
Name:
BDBM50263110
Synonyms:
2-(dimethylamino)-1-(4-(4-(4-(1-isopropyl-2-methyl-1H-imidazol-5-yl)pyrimidin-2-ylamino)phenyl)piperazin-1-yl)ethanone | CHEMBL478241
Type:
Small organic molecule
Emp. Form.:
C25H34N8O
Mol. Mass.:
462.5905
SMILES:
CC(C)n1c(C)ncc1-c1ccnc(Nc2ccc(cc2)N2CCN(CC2)C(=O)CN(C)C)n1
: