Target
Bone morphogenetic protein 4
Ligand
BDBM50261872
Substrate
Meas. Tech.
ChEMBL_490878 (CHEMBL989154)
IC50
4500±n/a nM
Citation
 Cuny, GDYu, PBLaha, JKXing, XLiu, JFLai, CSDeng, DYSachidanandan, CBloch, KDPeterson, RT Structure-activity relationship study of bone morphogenetic protein (BMP) signaling inhibitors. Bioorg Med Chem Lett 18:4388-92 (2008)  
Target
Name:
Bone morphogenetic protein 4
Synonyms:
BMP2B BMP4_HUMAN | DVR4
Type:
PROTEIN
Mol. Mass.:
46572.96
Organism:
Homo sapiens (Human)
Description:
ChEMBL_1363193
Residue:
408
  
Inhibitor
Name:
BDBM50261872
Synonyms:
6-(3-(2-(4-methylpiperazin-1-yl)ethoxy)phenyl)-3-(pyridin-4-yl)pyrazolo[1,5-a]pyrimidine | CHEMBL469019
Type:
Small organic molecule
Emp. Form.:
C24H26N6O
Mol. Mass.:
414.5028
SMILES:
CN1CCN(CCOc2cccc(c2)-c2cnc3c(cnn3c2)-c2ccncc2)CC1
: