Target
Bone morphogenetic protein 4
Ligand
BDBM50261870
Substrate
Meas. Tech.
ChEMBL_490878 (CHEMBL989154)
IC50
500±n/a nM
Citation
 Cuny, GDYu, PBLaha, JKXing, XLiu, JFLai, CSDeng, DYSachidanandan, CBloch, KDPeterson, RT Structure-activity relationship study of bone morphogenetic protein (BMP) signaling inhibitors. Bioorg Med Chem Lett 18:4388-92 (2008)  
Target
Name:
Bone morphogenetic protein 4
Synonyms:
BMP2B BMP4_HUMAN | DVR4
Type:
PROTEIN
Mol. Mass.:
46572.96
Organism:
Homo sapiens (Human)
Description:
ChEMBL_1363193
Residue:
408
  
Inhibitor
Name:
BDBM50261870
Synonyms:
CHEMBL511216 | N,N-diethyl-2-(4-(3-(pyridin-4-yl)pyrazolo[1,5-a]pyrimidin-6-yl)phenoxy)ethanamine
Type:
Small organic molecule
Emp. Form.:
C23H25N5O
Mol. Mass.:
387.4775
SMILES:
CCN(CC)CCOc1ccc(cc1)-c1cnc2c(cnn2c1)-c1ccncc1
: