Target
Voltage-dependent T-type calcium channel subunit alpha-1G
Ligand
BDBM50262132
Substrate
Meas. Tech.
ChEMBL_513516 (CHEMBL978138)
IC50
53.02±n/a nM
Citation
 Lee, HKLee, YSRoh, EJRhim, HLee, JYShin, KJ Synthesis and evaluation of alpha,alpha'-disubstituted phenylacetate derivatives for T-type calcium channel blockers. Bioorg Med Chem Lett 18:4424-7 (2008)  
Target
Name:
Voltage-dependent T-type calcium channel subunit alpha-1G
Synonyms:
CAC1G_HUMAN KIAA1123 Voltage-gated T-type calcium channel alpha-1G subunit
Type:
PROTEIN
Mol. Mass.:
262471.14
Organism:
Homo sapiens (Human)
Description:
ChEMBL_1515216
Residue:
2377
  
Inhibitor
Name:
BDBM50262132
Synonyms:
CHEMBL468409 | methyl 2-(4-bromophenyl)-5-((3-(5,6-dimethyl-1H-benzo[d]imidazol-2-yl)propyl)(methyl)amino)-2-isopropylpentanoate
Type:
Small organic molecule
Emp. Form.:
C28H38BrN3O2
Mol. Mass.:
528.524
SMILES:
COC(=O)C(CCCN(C)CCCc1nc2cc(C)c(C)cc2[nH]1)(C(C)C)c1ccc(Br)cc1
: