Target
Mitogen-activated protein kinase 14
Ligand
BDBM50262025
Substrate
Meas. Tech.
ChEMBL_513585 (CHEMBL967081)
IC50
0.7±n/a nM
Citation
 Bharate, SBMahajan, TRGole, YRNambiar, MMatan, TTKulkarni-Almeida, ABalachandran, SJunjappa, HBalakrishnan, AVishwakarma, RA Synthesis and evaluation of pyrazolo[3,4-b]pyridines and its structural analogues as TNF-alpha and IL-6 inhibitors. Bioorg Med Chem 16:7167-76 (2008)  
Target
Name:
Mitogen-activated protein kinase 14
Synonyms:
CSAID-binding protein CSBP1 CSPB1 MAP kinase 14 MAP kinase p38 alpha MAPK14 MK14_HUMAN Mitogen-activated protein kinase p38 alpha Stress-activated protein kinase 2a | p38 MAP kinase alpha/beta
Type:
Serine/threonine-protein kinase
Mol. Mass.:
41286.76
Organism:
Homo sapiens (Human)
Description:
Q16539
Residue:
360
  
Inhibitor
Name:
BDBM50262025
Synonyms:
3-(6-(2,4-difluorophenylamino)-1H-pyrazolo[3,4-b]pyridin-3-yl)-4-methoxy-N-morpholinobenzamide | CHEMBL512255
Type:
Small organic molecule
Emp. Form.:
C24H22F2N6O3
Mol. Mass.:
480.4667
SMILES:
COc1ccc(cc1-c1n[nH]c2nc(Nc3ccc(F)cc3F)ccc12)C(=O)NN1CCOCC1
: