Target
Glutamate racemase
Ligand
BDBM50215444
Substrate
Meas. Tech.
ChEMBL_514356 (CHEMBL967970)
IC50
1400±n/a nM
Citation
 Basarab, GSHill, PJRastagar, AWebborn, PJ Design of Helicobacter pylori glutamate racemase inhibitors as selective antibacterial agents: a novel pro-drug approach to increase exposure. Bioorg Med Chem Lett 18:4716-22 (2008)  
Target
Name:
Glutamate racemase
Synonyms:
MURI_HELPY murI
Type:
PROTEIN
Mol. Mass.:
28413.39
Organism:
Helicobacter pylori
Description:
ChEMBL_475324
Residue:
255
  
Inhibitor
Name:
BDBM50215444
Synonyms:
5-METHYL-7-(2-METHYLPROPYL)-2-(NAPHTHALEN-1-YLMETHYL)-3-PYRIDIN-4-YL-2H-PYRAZOLO[3,4-D]PYRIMIDINE-4,6(5H,7H)-DIONE 7-isobutyl-5-methyl-2-(naphthalen-1-ylmethyl)-3-(pyridin-4-yl)-2H-pyrazolo[3,4-d]pyrimidine-4,6(5H,7H)-dione | CHEMBL401874
Type:
Small organic molecule
Emp. Form.:
C26H25N5O2
Mol. Mass.:
439.509
SMILES:
CC(C)Cn1c2nn(Cc3cccc4ccccc34)c(-c3ccncc3)c2c(=O)n(C)c1=O
: