Target
Gamma-aminobutyric acid receptor subunit alpha-6
Ligand
BDBM50273110
Substrate
Meas. Tech.
ChEMBL_514066 (CHEMBL979089)
IC50
76000±n/a nM
Citation
 Jansen, MRabe, HStrehle, ADieler, SDebus, FDannhardt, GAkabas, MHLüddens, H Synthesis of GABAA receptor agonists and evaluation of their alpha-subunit selectivity and orientation in the GABA binding site. J Med Chem 51:4430-48 (2008)  
Target
Name:
Gamma-aminobutyric acid receptor subunit alpha-6
Synonyms:
GABA A Alpha6Beta3Gamma2 GABA receptor alpha-6 subunit Gabra-6 Gamma-aminobutyric acid receptor subunit alpha-6
Type:
Enzyme Catalytic Domain
Mol. Mass.:
51188.24
Organism:
RAT
Description:
GABA A Alpha6Beta2Gamma2 0 RAT::P30191
Residue:
453
  
Inhibitor
Name:
BDBM50273110
Synonyms:
4-(5-Methyl-[1,3,4]oxadiazol-2-yl)-piperidine Hydrochloride | CHEMBL502932
Type:
Small organic molecule
Emp. Form.:
C8H13N3O
Mol. Mass.:
167.2083
SMILES:
Cc1nnc(o1)C1CCNCC1
: