Target
11-beta-hydroxysteroid dehydrogenase 1
Ligand
BDBM50249527
Substrate
Meas. Tech.
ChEMBL_500342 (CHEMBL973434)
IC50
980±n/a nM
Citation
 Yang, HShen, YChen, JJiang, QLeng, YShen, J Structure-based virtual screening for identification of novel 11beta-HSD1 inhibitors. Eur J Med Chem 44:1167-71 (2009)  
Target
Name:
11-beta-hydroxysteroid dehydrogenase 1
Synonyms:
11-DH 11-beta-Hydroxysteroid Dehydrogenase 1 (11-beta-HSD1) 11-beta-hydroxysteroid dehydrogenase 1 (11HSD1) Corticosteroid 11-beta-dehydrogenase isozyme 1 (11-beta-HSD-1) Corticosteroid 11-beta-dehydrogenase isozyme 1 (11beta-HSD1) HSD11 HSD11L | SDR26C1
Type:
Enzyme
Mol. Mass.:
32409.16
Organism:
Homo sapiens (Human)
Description:
P28845
Residue:
292
  
Inhibitor
Name:
BDBM50249527
Synonyms:
CHEMBL470533 | ethyl 5-(2,5-dimethylphenylsulfonamido)-2-propylbenzofuran-3-carboxylate
Type:
Small organic molecule
Emp. Form.:
C22H25NO5S
Mol. Mass.:
415.503
SMILES:
CCCc1oc2ccc(NS(=O)(=O)c3cc(C)ccc3C)cc2c1C(=O)OCC
: