Target
Receptor tyrosine-protein kinase erbB-2
Ligand
BDBM50272883
Substrate
Meas. Tech.
ChEMBL_509683 (CHEMBL1007321)
IC50
72±n/a nM
Citation
 Xu, GAbad, MCConnolly, PJNeeper, MPStruble, GTSpringer, BAEmanuel, SLPandey, NGruninger, RHAdams, MMoreno-Mazza, SFuentes-Pesquera, ARMiddleton, SA 4-Amino-6-arylamino-pyrimidine-5-carbaldehyde hydrazones as potent ErbB-2/EGFR dual kinase inhibitors. Bioorg Med Chem Lett 18:4615-9 (2008)  
Target
Name:
Receptor tyrosine-protein kinase erbB-2
Synonyms:
2.7.10.1 CD_antigen=CD340 ERBB2_HUMAN FASN/HER2 HER2 MLN19 NEU Proto-oncogene Neu Tyrosine kinase-type cell surface receptor HER2 | p185erbB2
Type:
Mol. Mass.:
137894.47
Organism:
Homo sapiens (Human)
Description:
P04626
Residue:
1255
  
Inhibitor
Name:
BDBM50272883
Synonyms:
(R,E)-N4-(1-(3-fluorobenzyl)-1H-indazol-5-yl)-5-((2-(methoxymethyl)pyrrolidin-1-ylimino)methyl)pyrimidine-4,6-diamine | CHEMBL515664
Type:
Small organic molecule
Emp. Form.:
C25H27FN8O
Mol. Mass.:
474.5333
SMILES:
COC[C@H]1CCCN1\N=C\c1c(N)ncnc1Nc1ccc2n(Cc3cccc(F)c3)ncc2c1
: