Target
Gonadotropin-releasing hormone receptor
Ligand
BDBM50272658
Substrate
Meas. Tech.
ChEMBL_510057 (CHEMBL995200)
Ki
1.1±n/a nM
Citation
 Regan, CFGuo, ZChen, YHuang, CQChen, MJiang, WRueter, JKCoon, TChen, CSaunders, JBrown, MSBetz, SFStruthers, RSYang, CWen, JMadan, AZhu, YF Zwitterionic uracil derivatives as potent GnRH receptor antagonists with improved pharmaceutical properties. Bioorg Med Chem Lett 18:4503-7 (2008)  
Target
Name:
Gonadotropin-releasing hormone receptor
Synonyms:
GNRHR GRHR GnRH-R Gonadotropin-releasing hormone receptor | Gonadotropin-releasing hormone receptor (GnRH)
Type:
Enzyme
Mol. Mass.:
37749.45
Organism:
Homo sapiens (Human)
Description:
P30968
Residue:
328
  
Inhibitor
Name:
BDBM50272658
Synonyms:
(R)-6-(3-(1-(2-fluoro-6-(trifluoromethyl)benzyl)-3-(2-amino-2-phenylethyl)-6-methyl-2,4-dioxo-1,2,3,4-tetrahydropyrimidin-5-yl)phenoxy)hexanoic acid | CHEMBL453441
Type:
Small organic molecule
Emp. Form.:
C33H33F4N3O5
Mol. Mass.:
627.6258
SMILES:
Cc1c(-c2cccc(OCCCCCC(O)=O)c2)c(=O)n(C[C@H](N)c2ccccc2)c(=O)n1Cc1c(F)cccc1C(F)(F)F
: