Target
Leukotriene A-4 hydrolase
Ligand
BDBM50272142
Substrate
Meas. Tech.
ChEMBL_510221 (CHEMBL1004837)
IC50
52±n/a nM
Citation
 Enomoto, HMorikawa, YMiyake, YTsuji, FMizuchi, MSuhara, HFujimura, KHoriuchi, MBan, M Synthesis and biological evaluation of N-mercaptoacylproline and N-mercaptoacylthiazolidine-4-carboxylic acid derivatives as leukotriene A4 hydrolase inhibitors. Bioorg Med Chem Lett 18:4529-32 (2008)  
Target
Name:
Leukotriene A-4 hydrolase
Synonyms:
LKHA4_CAVPO | LTA4H
Type:
PROTEIN
Mol. Mass.:
68972.78
Organism:
Cavia porcellus
Description:
ChEMBL_544515
Residue:
611
  
Inhibitor
Name:
BDBM50272142
Synonyms:
(2S,5S)-5-(4-isopropylbenzylthio)-1-((S)-3-mercapto-2-methylpropanoyl)pyrrolidine-2-carboxylic acid | CHEMBL449792
Type:
Small organic molecule
Emp. Form.:
C19H27NO3S2
Mol. Mass.:
381.553
SMILES:
CC(C)c1ccc(CS[C@H]2CC[C@H](N2C(=O)[C@H](C)CS)C(O)=O)cc1
: