Target
B1 bradykinin receptor
Ligand
BDBM50272456
Substrate
Meas. Tech.
ChEMBL_510232 (CHEMBL1005610)
IC50
0.14±n/a nM
Citation
 Chen, JJQian, WBiswas, KViswanadhan, VNAskew, BCHitchcock, SHungate, RWArik, LJohnson, E Discovery of dihydroquinoxalinone acetamides containing bicyclic amines as potent Bradykinin B1 receptor antagonists. Bioorg Med Chem Lett 18:4477-81 (2008)  
Target
Name:
B1 bradykinin receptor
Synonyms:
B1 BRADYKININ B1R BK-1 receptor BRADYB1 | Bradykinin B1 receptor
Type:
Enzyme
Mol. Mass.:
40508.87
Organism:
Homo sapiens (Human)
Description:
P46663
Residue:
353
  
Inhibitor
Name:
BDBM50272456
Synonyms:
2-((R)-3-oxo-1-tosyl-1,2,3,4-tetrahydroquinoxalin-2-yl)-N-((R)-7-(piperidin-1-ylmethyl)chroman-4-yl)acetamide | CHEMBL447870
Type:
Small organic molecule
Emp. Form.:
C32H36N4O5S
Mol. Mass.:
588.717
SMILES:
Cc1ccc(cc1)S(=O)(=O)N1[C@H](CC(=O)N[C@@H]2CCOc3cc(CN4CCCCC4)ccc23)C(=O)Nc2ccccc12
: