Target
Coagulation factor X
Ligand
BDBM50272479
Substrate
Meas. Tech.
ChEMBL_510236 (CHEMBL1005614)
Ki
2700±n/a nM
Citation
 Shiraishi, TKadono, SHaramura, MKodama, HOno, YIikura, HEsaki, TKoga, THattori, KWatanabe, YSakamoto, AYoshihashi, KKitazawa, TEsaki, KOhta, MSato, HKozono, T Factor VIIa inhibitors: target hopping in the serine protease family using X-ray structure determination. Bioorg Med Chem Lett 18:4533-7 (2008)  
Target
Name:
Coagulation factor X
Synonyms:
Activated coagulation factor X (FXa) Coagulation factor X precursor F10 Factor X heavy chain Factor Xa Stuart-Prower factor
Type:
Enzyme
Mol. Mass.:
54726.60
Organism:
Homo sapiens (Human)
Description:
Residue:
488
  
Inhibitor
Name:
BDBM50272479
Synonyms:
(S)-2-[(2R,3S)-3-Methyl-2-(propane-1-sulfonylamino)-pentanoylamino]-pentanedioic acid 5-amide 1-(4-carbamimidoyl-benzylamide) | CHEMBL498660
Type:
Small organic molecule
Emp. Form.:
C22H36N6O5S
Mol. Mass.:
496.623
SMILES:
CCCS(=O)(=O)N[C@H]([C@@H](C)CC)C(=O)N[C@@H](CCC(N)=O)C(=O)NCc1ccc(cc1)C(N)=N
: