Target
Coagulation factor VII
Ligand
BDBM50272537
Substrate
Meas. Tech.
ChEMBL_510234 (CHEMBL1005612)
Ki
42±n/a nM
Citation
 Shiraishi, TKadono, SHaramura, MKodama, HOno, YIikura, HEsaki, TKoga, THattori, KWatanabe, YSakamoto, AYoshihashi, KKitazawa, TEsaki, KOhta, MSato, HKozono, T Factor VIIa inhibitors: target hopping in the serine protease family using X-ray structure determination. Bioorg Med Chem Lett 18:4533-7 (2008)  
Target
Name:
Coagulation factor VII
Synonyms:
Eptacog alfa FA7_HUMAN Factor VIIa (fVIIa) SPCA serum prothrombin conversion accelerator
Type:
Enzyme
Mol. Mass.:
51599.89
Organism:
Homo sapiens (Human)
Description:
Residue:
466
  
Inhibitor
Name:
BDBM50272537
Synonyms:
(2R,3R)-N-[(S)-1-(4-Carbamimidoyl-benzylcarbamoyl)-3-methylsulfanyl-propyl]-3-hydroxy-2-phenylmethanesulfonylamino-butyramide | CHEMBL498339
Type:
Small organic molecule
Emp. Form.:
C24H33N5O5S2
Mol. Mass.:
535.679
SMILES:
CSCC[C@H](NC(=O)[C@H](NS(=O)(=O)Cc1ccccc1)[C@@H](C)O)C(=O)NCc1ccc(cc1)C(N)=N
: