Target
Coagulation factor VII
Ligand
BDBM50272500
Substrate
Meas. Tech.
ChEMBL_510234 (CHEMBL1005612)
Ki
198±n/a nM
Citation
 Shiraishi, TKadono, SHaramura, MKodama, HOno, YIikura, HEsaki, TKoga, THattori, KWatanabe, YSakamoto, AYoshihashi, KKitazawa, TEsaki, KOhta, MSato, HKozono, T Factor VIIa inhibitors: target hopping in the serine protease family using X-ray structure determination. Bioorg Med Chem Lett 18:4533-7 (2008)  
Target
Name:
Coagulation factor VII
Synonyms:
Eptacog alfa FA7_HUMAN Factor VIIa (fVIIa) SPCA serum prothrombin conversion accelerator
Type:
Enzyme
Mol. Mass.:
51599.89
Organism:
Homo sapiens (Human)
Description:
Residue:
466
  
Inhibitor
Name:
BDBM50272500
Synonyms:
(S)-2-[(2R,3R)-3-Hydroxy-2-(propane-1-sulfonylamino)-butyrylamino]-pentanedioic acid 5-amide 1-(4-carbamimidoyl-benzylamide) | CHEMBL498675
Type:
Small organic molecule
Emp. Form.:
C20H32N6O6S
Mol. Mass.:
484.57
SMILES:
CCCS(=O)(=O)N[C@H]([C@@H](C)O)C(=O)N[C@@H](CCC(N)=O)C(=O)NCc1ccc(cc1)C(N)=N
: