Target
Coagulation factor X
Ligand
BDBM50272536
Substrate
Meas. Tech.
ChEMBL_510236 (CHEMBL1005614)
Ki
25000±n/a nM
Citation
 Shiraishi, TKadono, SHaramura, MKodama, HOno, YIikura, HEsaki, TKoga, THattori, KWatanabe, YSakamoto, AYoshihashi, KKitazawa, TEsaki, KOhta, MSato, HKozono, T Factor VIIa inhibitors: target hopping in the serine protease family using X-ray structure determination. Bioorg Med Chem Lett 18:4533-7 (2008)  
Target
Name:
Coagulation factor X
Synonyms:
Activated coagulation factor X (FXa) Coagulation factor X precursor F10 Factor X heavy chain Factor Xa Stuart-Prower factor
Type:
Enzyme
Mol. Mass.:
54726.60
Organism:
Homo sapiens (Human)
Description:
Residue:
488
  
Inhibitor
Name:
BDBM50272536
Synonyms:
(2R,3R)-N-[(S)-1-(4-Carbamimidoyl-benzylcarbamoyl)-3-methylsulfanyl-propyl]-3-hydroxy-2-(propane-1-sulfonylamino)-butyramide | CHEMBL524462
Type:
Small organic molecule
Emp. Form.:
C20H33N5O5S2
Mol. Mass.:
487.637
SMILES:
CCCS(=O)(=O)N[C@H]([C@@H](C)O)C(=O)N[C@@H](CCSC)C(=O)NCc1ccc(cc1)C(N)=N
: