Target
Prothrombin
Ligand
BDBM50272538
Substrate
Meas. Tech.
ChEMBL_510235 (CHEMBL1005613)
Ki
5490±n/a nM
Citation
 Shiraishi, TKadono, SHaramura, MKodama, HOno, YIikura, HEsaki, TKoga, THattori, KWatanabe, YSakamoto, AYoshihashi, KKitazawa, TEsaki, KOhta, MSato, HKozono, T Factor VIIa inhibitors: target hopping in the serine protease family using X-ray structure determination. Bioorg Med Chem Lett 18:4533-7 (2008)  
Target
Name:
Prothrombin
Synonyms:
Activation peptide fragment 1 Coagulation factor II Prothrombin precursor Thrombin heavy chain | Thrombin light chain
Type:
Protein
Mol. Mass.:
70029.57
Organism:
Homo sapiens (Human)
Description:
P00734
Residue:
622
  
Inhibitor
Name:
BDBM50272538
Synonyms:
2-({(1S,2S)-1-[(S)-1-(4-Carbamimidoyl-benzylcarbamoyl)-3-carbamoyl-propylcarbamoyl]-2-methyl-butylsulfamoyl}-methyl)-benzoic acid | CHEMBL505986
Type:
Small organic molecule
Emp. Form.:
C27H36N6O7S
Mol. Mass.:
588.676
SMILES:
CC[C@H](C)[C@H](NS(=O)(=O)Cc1ccccc1C(O)=O)C(=O)N[C@@H](CCC(N)=O)C(=O)NCc1ccc(cc1)C(N)=N
: