Target
Cyclin-dependent kinase 1
Ligand
BDBM50245409
Substrate
Meas. Tech.
ChEMBL_512836 (CHEMBL972549)
IC50
>100000±n/a nM
Citation
 Hughes, TVXu, GWetter, SKConnolly, PJEmanuel, SLKarnachi, PPollack, SRPandey, NAdams, MMoreno-Mazza, SMiddleton, SAGreenberger, LM A novel 5-[1,3,4-oxadiazol-2-yl]-N-aryl-4,6-pyrimidine diamine having dual EGFR/HER2 kinase activity: design, synthesis, and biological activity. Bioorg Med Chem Lett 18:4896-9 (2008)  
Target
Name:
Cyclin-dependent kinase 1
Synonyms:
CDC2 CDK1 CDKN1 Cell division protein kinase 1 P34CDC2 | p34 protein kinase
Type:
Enzyme Subunit
Mol. Mass.:
34101.08
Organism:
Homo sapiens (Human)
Description:
P06493
Residue:
297
  
Inhibitor
Name:
BDBM50245409
Synonyms:
4-amino-6-(4-(benzyloxy)-3-chlorophenylamino)-N-(2-methoxyethyl)pyrimidine-5-carboxamide | CHEMBL517745
Type:
Small organic molecule
Emp. Form.:
C21H22ClN5O3
Mol. Mass.:
427.884
SMILES:
COCCNC(=O)c1c(N)ncnc1Nc1ccc(OCc2ccccc2)c(Cl)c1
: