Target
Mu-type opioid receptor
Ligand
BDBM50272169
Substrate
Meas. Tech.
ChEMBL_510434 (CHEMBL1003110)
IC50
0.12±n/a nM
Citation
 Balboni, GFiorini, SBaldisserotto, ATrapella, CSasaki, YAmbo, AMarczak, EDLazarus, LHSalvadori, S Further studies on lead compounds containing the opioid pharmacophore Dmt-Tic. J Med Chem 51:5109-17 (2008)  
Target
Name:
Mu-type opioid receptor
Synonyms:
Mu-opioid receptor
Type:
PROTEIN
Mol. Mass.:
44729.40
Organism:
Cavia porcellus
Description:
ChEMBL_510437
Residue:
400
  
Inhibitor
Name:
BDBM50272169
Synonyms:
(S)-3-((S)-2-((S)-2-amino-3-(4-hydroxy-2,6-dimethylphenyl)propanoyl)-1,2,3,4-tetrahydroisoquinoline-3-carboxamido)-3-(1H-benzo[d]imidazol-2-yl)propanoic acid CHEMBL442577 UFP-512
Type:
Small organic molecule
Emp. Form.:
C31H33N5O5
Mol. Mass.:
555.6242
SMILES:
Cc1cc(O)cc(C)c1C[C@H](N)C(=O)N1Cc2ccccc2C[C@H]1C(=O)N[C@@H](CC(O)=O)c1nc2ccccc2[nH]1
: