Target
Ephrin type-A receptor 7
Ligand
BDBM50244430
Substrate
Meas. Tech.
ChEMBL_511642 (CHEMBL976289)
IC50
>1000±n/a nM
Citation
 Wang, YShakespeare, WCHuang, WSSundaramoorthi, RLentini, SDas, SLiu, SBanda, GWen, DZhu, XXu, QKeats, JWang, FWardwell, SNing, YSnodgrass, JTBroudy, MIRussian, KDalgarno, DClackson, TSawyer, TK Novel N9-arenethenyl purines as potent dual Src/Abl tyrosine kinase inhibitors. Bioorg Med Chem Lett 18:4907-12 (2008)  
Target
Name:
Ephrin type-A receptor 7
Synonyms:
2.7.10.1 EHK3 EPH homology kinase 3 EPHA7 Ephrin receptor Tyrosine Kinase EPHA6 | Tyrosine Kinase EPHA7
Type:
Mol. Mass.:
112085.32
Organism:
Homo sapiens (Human)
Description:
Residue:
998
  
Inhibitor
Name:
BDBM50244430
Synonyms:
9-(2,6-dimethylstyryl)-N-(4-(dimethylphosphoryl)phenyl)-9H-purin-6-amine CHEMBL488840
Type:
Small organic molecule
Emp. Form.:
C23H24N5OP
Mol. Mass.:
417.4433
SMILES:
Cc1cccc(C)c1\C=C\n1cnc2c(Nc3ccc(cc3)P(C)(C)=O)ncnc12
: