Target
Tyrosine-protein kinase ABL1
Ligand
BDBM50244666
Substrate
Meas. Tech.
ChEMBL_511628 (CHEMBL976275)
IC50
0.500000±n/a nM
Citation
 Wang, YShakespeare, WCHuang, WSSundaramoorthi, RLentini, SDas, SLiu, SBanda, GWen, DZhu, XXu, QKeats, JWang, FWardwell, SNing, YSnodgrass, JTBroudy, MIRussian, KDalgarno, DClackson, TSawyer, TK Novel N9-arenethenyl purines as potent dual Src/Abl tyrosine kinase inhibitors. Bioorg Med Chem Lett 18:4907-12 (2008)  
Target
Name:
Tyrosine-protein kinase ABL1
Synonyms:
ABL ABL1_HUMAN JTK7 Proto-oncogene tyrosine-protein kinase ABL1 Tyrosine-protein kinase ABL V-abl Abelson murine leukemia viral oncogene homolog 1 p150 | tyrosine-protein kinase ABL1 isoform a
Type:
Enzyme
Mol. Mass.:
122897.30
Organism:
Homo sapiens (Human)
Description:
P00519
Residue:
1130
  
Inhibitor
Name:
BDBM50244666
Synonyms:
9-(2,6-dimethylstyryl)-N-(4-(dimethylphosphoryl)phenyl)-2-(pyridin-3-yloxy)-9H-purin-6-amine | CHEMBL518166
Type:
Small organic molecule
Emp. Form.:
C28H27N6O2P
Mol. Mass.:
510.5267
SMILES:
Cc1cccc(C)c1\C=C\n1cnc2c(Nc3ccc(cc3)P(C)(C)=O)nc(Oc3cccnc3)nc12
: