Target
Tyrosine-protein kinase ABL1
Ligand
BDBM50244664
Substrate
Meas. Tech.
ChEMBL_511628 (CHEMBL976275)
IC50
1.6±n/a nM
Citation
 Wang, YShakespeare, WCHuang, WSSundaramoorthi, RLentini, SDas, SLiu, SBanda, GWen, DZhu, XXu, QKeats, JWang, FWardwell, SNing, YSnodgrass, JTBroudy, MIRussian, KDalgarno, DClackson, TSawyer, TK Novel N9-arenethenyl purines as potent dual Src/Abl tyrosine kinase inhibitors. Bioorg Med Chem Lett 18:4907-12 (2008)  
Target
Name:
Tyrosine-protein kinase ABL1
Synonyms:
ABL ABL1_HUMAN JTK7 Proto-oncogene tyrosine-protein kinase ABL1 Tyrosine-protein kinase ABL V-abl Abelson murine leukemia viral oncogene homolog 1 p150 | tyrosine-protein kinase ABL1 isoform a
Type:
Enzyme
Mol. Mass.:
122897.30
Organism:
Homo sapiens (Human)
Description:
P00519
Residue:
1130
  
Inhibitor
Name:
BDBM50244664
Synonyms:
9-(2,6-dimethylstyryl)-N-(4-(dimethylphosphoryl)phenyl)-2-(2-methoxyethoxy)-9H-purin-6-amine | CHEMBL461767
Type:
Small organic molecule
Emp. Form.:
C26H30N5O3P
Mol. Mass.:
491.5219
SMILES:
COCCOc1nc(Nc2ccc(cc2)P(C)(C)=O)c2ncn(\C=C\c3c(C)cccc3C)c2n1
: