Target
Tyrosine aminotransferase
Ligand
BDBM50272522
Substrate
Meas. Tech.
ChEMBL_510612 (CHEMBL1002259)
EC50
70.3±n/a nM
Citation
 Ali, ABalkovec, JMGreenlee, MHammond, MLRouen, GTaylor, GEinstein, MGe, LHarris, GKelly, TMMazur, PPandit, SSantoro, JSitlani, AWang, CWilliamson, JForrest, MJCarballo-Jane, ELuell, SLowitz, KVisco, D Discovery of betamethasone 17alpha-carbamates as dissociated glucocorticoid receptor modulators in the rat. Bioorg Med Chem 16:7535-42 (2008)  
Target
Name:
Tyrosine aminotransferase
Synonyms:
ATTY_RAT | Tat
Type:
PROTEIN
Mol. Mass.:
50625.47
Organism:
Rattus norvegicus
Description:
ChEMBL_510612
Residue:
454
  
Inhibitor
Name:
BDBM50272522
Synonyms:
(11beta,16beta)-9-Fluoro-11,21-dihydroxy-16-methyl-3,20-dioxopregna-1,4-dien-17-yl (1R)-1-phenylethylcarbamate | CHEMBL509182
Type:
Small organic molecule
Emp. Form.:
C31H38FNO6
Mol. Mass.:
539.6349
SMILES:
C[C@@H](NC(=O)O[C@@]1([C@@H](C)C[C@H]2[C@@H]3CCC4=CC(=O)C=C[C@]4(C)[C@@]3(F)[C@@H](O)C[C@]12C)C(=O)CO)c1ccccc1
: