Target
Ras guanyl-releasing protein 3
Ligand
BDBM50245091
Substrate
Meas. Tech.
ChEMBL_512396 (CHEMBL979907)
Ki
2.22±n/a nM
Citation
 Duan, DSigano, DMKelley, JALai, CCLewin, NEKedei, NPeach, MLLee, JAbeyweera, TPRotenberg, SAKim, HKim, YHEl Kazzouli, SChung, JUYoung, HAYoung, MRBaker, AColburn, NHHaimovitz-Friedman, ATruman, JPParrish, DADeschamps, JRPerry, NASurawski, RJBlumberg, PMMarquez, VE Conformationally constrained analogues of diacylglycerol. 29. Cells sort diacylglycerol-lactone chemical zip codes to produce diverse and selective biological activities. J Med Chem 51:5198-220 (2008)  
Target
Name:
Ras guanyl-releasing protein 3
Synonyms:
GRP3 KIAA0846 RASGRP3
Type:
PROTEIN
Mol. Mass.:
78335.20
Organism:
Homo sapiens (Human)
Description:
ChEMBL_1364407
Residue:
690
  
Inhibitor
Name:
BDBM50245091
Synonyms:
CHEMBL519398 rac-(E/Z)-(4-(4-nitrobenzylidene)-2-(hydroxymethyl)-5-oxo-tetrahydrofuran-2-yl)methyl 4-nitrobenzoate
Type:
Small organic molecule
Emp. Form.:
C20H16N2O9
Mol. Mass.:
428.349
SMILES:
OCC1(COC(=O)c2ccc(cc2)[N+]([O-])=O)C\C(=C/c2ccc(cc2)[N+]([O-])=O)C(=O)O1
: