Target
Peroxisome proliferator-activated receptor gamma
Ligand
BDBM50244701
Substrate
Meas. Tech.
ChEMBL_512442 (CHEMBL980783)
EC50
2±n/a nM
Citation
 Debenham, SDChan, ALau, FWLiu, WWood, HBLemme, KColwell, LHabulihaz, BAkiyama, TEEinstein, MDoebber, TWSharma, NWang, CFWu, MBerger, JPMeinke, PT Highly functionalized 7-azaindoles as selective PPAR gamma modulators. Bioorg Med Chem Lett 18:4798-801 (2008)  
Target
Name:
Peroxisome proliferator-activated receptor gamma
Synonyms:
NR1C3 PPAR-gamma PPARG_HUMAN Peroxisome proliferator-activated receptor gamma (PPAR gamma) Peroxisome proliferator-activated receptor gamma (PPARĪ³) peroxisome proliferator-activated receptor gamma isoform 2
Type:
Nuclear Receptor
Mol. Mass.:
57613.46
Organism:
Homo sapiens (Human)
Description:
P37231
Residue:
505
  
Inhibitor
Name:
BDBM50244701
Synonyms:
(S)-2-(4-chloro-3-((6-methoxy-3-(4-methoxybenzoyl)-2-methyl-1H-pyrrolo[2,3-b]pyridin-1-yl)methyl)phenoxy)propanoic acid | CHEMBL460073
Type:
Small organic molecule
Emp. Form.:
C27H25ClN2O6
Mol. Mass.:
508.95
SMILES:
COc1ccc(cc1)C(=O)c1c(C)n(Cc2cc(O[C@@H](C)C(O)=O)ccc2Cl)c2nc(OC)ccc12
: