Target
Beta-3 adrenergic receptor
Ligand
BDBM50244809
Substrate
Meas. Tech.
ChEMBL_512426 (CHEMBL980767)
IC50
4860±n/a nM
Citation
 Debenham, SDChan, ALau, FWLiu, WWood, HBLemme, KColwell, LHabulihaz, BAkiyama, TEEinstein, MDoebber, TWSharma, NWang, CFWu, MBerger, JPMeinke, PT Highly functionalized 7-azaindoles as selective PPAR gamma modulators. Bioorg Med Chem Lett 18:4798-801 (2008)  
Target
Name:
Beta-3 adrenergic receptor
Synonyms:
ADRB3 ADRB3_HUMAN Beta-2 adrenergic receptor and beta-3 adrenergic receptor Beta-3 adrenoreceptor | adrenergic Beta3
Type:
G Protein-Coupled Receptor (GPCR)
Mol. Mass.:
43534.88
Organism:
Homo sapiens (Human)
Description:
Residue:
408
  
Inhibitor
Name:
BDBM50244809
Synonyms:
(2R)-2-[3-[[3-(4-Chlorobenzoyl)-2-methyl-6-(trifluoromethoxy)-1H-indol-1-yl]methyl]phenoxy]propanoicAcid CHEMBL461571
Type:
Small organic molecule
Emp. Form.:
C27H21ClF3NO5
Mol. Mass.:
531.908
SMILES:
C[C@@H](Oc1cccc(Cn2c(C)c(C(=O)c3ccc(Cl)cc3)c3ccc(OC(F)(F)F)cc23)c1)C(O)=O
: