Target
Thromboxane A2 receptor
Ligand
BDBM50244809
Substrate
Meas. Tech.
ChEMBL_512440 (CHEMBL980781)
IC50
2030.0±n/a nM
Citation
 Debenham, SDChan, ALau, FWLiu, WWood, HBLemme, KColwell, LHabulihaz, BAkiyama, TEEinstein, MDoebber, TWSharma, NWang, CFWu, MBerger, JPMeinke, PT Highly functionalized 7-azaindoles as selective PPAR gamma modulators. Bioorg Med Chem Lett 18:4798-801 (2008)  
Target
Name:
Thromboxane A2 receptor
Synonyms:
Prostanoid TP receptor TBXA2R Thromboxane Thromboxane Beta
Type:
Enyzme
Mol. Mass.:
37445.28
Organism:
Homo sapiens (Human)
Description:
P21731
Residue:
343
  
Inhibitor
Name:
BDBM50244809
Synonyms:
(2R)-2-[3-[[3-(4-Chlorobenzoyl)-2-methyl-6-(trifluoromethoxy)-1H-indol-1-yl]methyl]phenoxy]propanoicAcid CHEMBL461571
Type:
Small organic molecule
Emp. Form.:
C27H21ClF3NO5
Mol. Mass.:
531.908
SMILES:
C[C@@H](Oc1cccc(Cn2c(C)c(C(=O)c3ccc(Cl)cc3)c3ccc(OC(F)(F)F)cc23)c1)C(O)=O
: