Target
Peroxisome proliferator-activated receptor alpha
Ligand
BDBM50244749
Substrate
Meas. Tech.
ChEMBL_512448 (CHEMBL980789)
IC50
>50000±n/a nM
Citation
 Debenham, SDChan, ALau, FWLiu, WWood, HBLemme, KColwell, LHabulihaz, BAkiyama, TEEinstein, MDoebber, TWSharma, NWang, CFWu, MBerger, JPMeinke, PT Highly functionalized 7-azaindoles as selective PPAR gamma modulators. Bioorg Med Chem Lett 18:4798-801 (2008)  
Target
Name:
Peroxisome proliferator-activated receptor alpha
Synonyms:
NR1C1 PPAR PPAR-alpha PPARA_HUMAN Peroxisome proliferator-activated receptor | Peroxisome proliferator-activated receptor alpha (PPAR alpha)
Type:
Enzyme
Mol. Mass.:
52222.08
Organism:
Homo sapiens (Human)
Description:
Q07869
Residue:
468
  
Inhibitor
Name:
BDBM50244749
Synonyms:
(S)-2-(5-((3-(4-chlorophenoxy)-6-fluoro-2-methyl-1H-pyrrolo[2,3-b]pyridin-1-yl)methyl)-2-fluorophenoxy)propanoic acid | CHEMBL461379
Type:
Small organic molecule
Emp. Form.:
C24H19ClF2N2O4
Mol. Mass.:
472.868
SMILES:
C[C@H](Oc1cc(Cn2c(C)c(Oc3ccc(Cl)cc3)c3ccc(F)nc23)ccc1F)C(O)=O
: