Target
Cytosolic endo-beta-N-acetylglucosaminidase
Ligand
BDBM50235890
Substrate
Meas. Tech.
ChEMBL_512953 (CHEMBL977289)
IC50
750000±n/a nM
Citation
 Yoshimura, YOhara, CImahori, TSaito, YKato, AMiyauchi, SAdachi, ITakahata, H Synthesis of both enantiomers of hydroxypipecolic acid derivatives equivalent to 5-azapyranuronic acids and evaluation of their inhibitory activities against glycosidases. Bioorg Med Chem 16:8273-86 (2008)  
Target
Name:
Cytosolic endo-beta-N-acetylglucosaminidase
Synonyms:
ENASE_HUMAN Endo-beta-N-acetylglucosaminidase
Type:
PROTEIN
Mol. Mass.:
83989.32
Organism:
Homo sapiens (Human)
Description:
ChEMBL_467019
Residue:
743
  
Inhibitor
Name:
BDBM50235890
Synonyms:
(2S,3S)-3-Hydroxybaikiain CHEMBL403603
Type:
Small organic molecule
Emp. Form.:
C6H9NO3
Mol. Mass.:
143.1406
SMILES:
O[C@H]1C=CCN[C@@H]1C(O)=O
: