Target
Ras guanyl-releasing protein 3
Ligand
BDBM50244476
Substrate
Meas. Tech.
ChEMBL_513189 (CHEMBL977319)
Ki
54±n/a nM
Citation
 El Kazzouli, SLewin, NEBlumberg, PMMarquez, VE Conformationally constrained analogues of diacylglycerol. 30. An investigation of diacylglycerol-lactones containing heteroaryl groups reveals compounds with high selectivity for Ras guanyl nucleotide-releasing proteins. J Med Chem 51:5371-86 (2008)  
Target
Name:
Ras guanyl-releasing protein 3
Synonyms:
GRP3 KIAA0846 RASGRP3
Type:
PROTEIN
Mol. Mass.:
78335.20
Organism:
Homo sapiens (Human)
Description:
ChEMBL_1364407
Residue:
690
  
Inhibitor
Name:
BDBM50244476
Synonyms:
(E)-(2-(hydroxymethyl)-5-oxo-4-(pyridin-4-ylmethylene)-tetrahydrofuran-2-yl)methyl 4-(dimethylamino)benzoate | CHEMBL488670
Type:
Small organic molecule
Emp. Form.:
C21H22N2O5
Mol. Mass.:
382.4098
SMILES:
CN(C)c1ccc(cc1)C(=O)OCC1(CO)C\C(=C/c2ccncc2)C(=O)O1
: