Target
Gastric inhibitory polypeptide receptor
Ligand
BDBM50245100
Substrate
Meas. Tech.
ChEMBL_513212 (CHEMBL977342)
IC50
277±n/a nM
Citation
 Kodra, JTJørgensen, ASAndersen, BBehrens, CBrand, CLChristensen, ITGuldbrandt, MJeppesen, CBKnudsen, LBMadsen, PNishimura, ESams, CSidelmann, UGPedersen, RALynn, FCLau, J Novel glucagon receptor antagonists with improved selectivity over the glucose-dependent insulinotropic polypeptide receptor. J Med Chem 51:5387-96 (2008)  
Target
Name:
Gastric inhibitory polypeptide receptor
Synonyms:
GIPR Gastric Inhibitory Polypeptide Receptor (GIPR) | Gastric inhibitory polypeptide receptor
Type:
PROTEIN
Mol. Mass.:
53173.82
Organism:
Homo sapiens (Human)
Description:
ChEMBL_1518286
Residue:
466
  
Inhibitor
Name:
BDBM50245100
Synonyms:
(R)-3-{4-[1-(4-Cyclohex-1-enylphenyl)-3-(3-fluoro-5-trifluoromethylphenyl)ureidomethyl]benzoylamino}-2-hydroxypropionic acid | CHEMBL447684
Type:
Small organic molecule
Emp. Form.:
C31H29F4N3O5
Mol. Mass.:
599.5727
SMILES:
O[C@H](CNC(=O)c1ccc(CN(C(=O)Nc2cc(F)cc(c2)C(F)(F)F)c2ccc(cc2)C2=CCCCC2)cc1)C(O)=O
: