Target
Gastric inhibitory polypeptide receptor
Ligand
BDBM50245061
Substrate
Meas. Tech.
ChEMBL_513212 (CHEMBL977342)
IC50
198±n/a nM
Citation
 Kodra, JTJørgensen, ASAndersen, BBehrens, CBrand, CLChristensen, ITGuldbrandt, MJeppesen, CBKnudsen, LBMadsen, PNishimura, ESams, CSidelmann, UGPedersen, RALynn, FCLau, J Novel glucagon receptor antagonists with improved selectivity over the glucose-dependent insulinotropic polypeptide receptor. J Med Chem 51:5387-96 (2008)  
Target
Name:
Gastric inhibitory polypeptide receptor
Synonyms:
GIPR Gastric Inhibitory Polypeptide Receptor (GIPR) | Gastric inhibitory polypeptide receptor
Type:
PROTEIN
Mol. Mass.:
53173.82
Organism:
Homo sapiens (Human)
Description:
ChEMBL_1518286
Residue:
466
  
Inhibitor
Name:
BDBM50245061
Synonyms:
(R)-3-{4-[3-(4-Cyano-3-trifluoromethylphenyl)-1-(4-cyclohexylphenyl)ureidomethyl]benzoylamino}-2-hydroxypropionic acid | CHEMBL504245
Type:
Small organic molecule
Emp. Form.:
C32H31F3N4O5
Mol. Mass.:
608.6075
SMILES:
O[C@H](CNC(=O)c1ccc(CN(C(=O)Nc2ccc(C#N)c(c2)C(F)(F)F)c2ccc(cc2)C2CCCCC2)cc1)C(O)=O
: