Target
Sodium/glucose cotransporter 2
Ligand
BDBM50245137
Substrate
Meas. Tech.
ChEMBL_513437 (CHEMBL977366)
EC50
290±n/a nM
Citation
 Ellsworth, BAMeng, WPatel, MGirotra, RNWu, GSher, PMHagan, DLObermeier, MTHumphreys, WGRobertson, JGWang, AHan, SWaldron, TLMorgan, NNWhaley, JMWashburn, WN Aglycone exploration of C-arylglucoside inhibitors of renal sodium-dependent glucose transporter SGLT2. Bioorg Med Chem Lett 18:4770-3 (2008)  
Target
Name:
Sodium/glucose cotransporter 2
Synonyms:
Na(+)/glucose cotransporter 2 SGLT2 Sodium-Dependent Glucose Cotransporter 2 (SGLT2) Solute carrier family 5 member 2
Type:
Protein
Mol. Mass.:
72902.00
Organism:
Homo sapiens (Human)
Description:
P31639
Residue:
672
  
Inhibitor
Name:
BDBM50245137
Synonyms:
(2R,3S,4R,5R,6S)-2-Hydroxymethyl-6-(4'-methyl-biphenyl-3-yl)-tetrahydro-pyran-3,4,5-triol | CHEMBL487667
Type:
Small organic molecule
Emp. Form.:
C19H22O5
Mol. Mass.:
330.375
SMILES:
Cc1ccc(cc1)-c1cccc(c1)[C@@H]1O[C@H](CO)[C@@H](O)[C@H](O)[C@H]1O
: