Target
Receptor-type tyrosine-protein phosphatase epsilon
Ligand
BDBM50246620
Substrate
Meas. Tech.
ChEMBL_557720 (CHEMBL963015)
IC50
>40000±n/a nM
Citation
 Zhang, YNZhang, WHong, DShi, LShen, QLi, JYLi, JHu, LH Oleanolic acid and its derivatives: new inhibitor of protein tyrosine phosphatase 1B with cellular activities. Bioorg Med Chem 16:8697-705 (2008)  
Target
Name:
Receptor-type tyrosine-protein phosphatase epsilon
Synonyms:
PTPRE Protein-tyrosine phosphatase epsilon Receptor-type tyrosine-protein phosphatase epsilon (PTPε)
Type:
Protein
Mol. Mass.:
80646.31
Organism:
Homo sapiens (Human)
Description:
P23469
Residue:
700
  
Inhibitor
Name:
BDBM50246620
Synonyms:
3-((4aR,6aS,6bR,8aR,10S,12aR,12bR,14bR)-10-hydroxy-2,2,6a,6b,9,9,12a-heptamethyl-1,2,3,4,4a,5,6,6a,6b,7,8,8a,9,10,11,12,12a,12b,13,14b-icosahydropicen-4a-yl)propanoic acid | CHEMBL472400
Type:
Small organic molecule
Emp. Form.:
C32H52O3
Mol. Mass.:
484.7535
SMILES:
CC1(C)CC[C@]2(CCC(O)=O)CC[C@]3(C)C(=CC[C@@H]4[C@@]5(C)CC[C@H](O)C(C)(C)[C@@H]5CC[C@@]34C)[C@@H]2C1
: