Target
Tyrosine-protein phosphatase non-receptor type 2
Ligand
BDBM50247109
Substrate
Meas. Tech.
ChEMBL_557716 (CHEMBL963011)
IC50
>20000±n/a nM
Citation
 Zhang, YNZhang, WHong, DShi, LShen, QLi, JYLi, JHu, LH Oleanolic acid and its derivatives: new inhibitor of protein tyrosine phosphatase 1B with cellular activities. Bioorg Med Chem 16:8697-705 (2008)  
Target
Name:
Tyrosine-protein phosphatase non-receptor type 2
Synonyms:
PTN2_HUMAN PTPT T-cell protein-tyrosine phosphatase TCPTP Tyrosine-protein phosphatase non-receptor type 2 (TC-PTP)
Type:
Protein
Mol. Mass.:
48481.80
Organism:
Homo sapiens (Human)
Description:
P17706
Residue:
415
  
Inhibitor
Name:
BDBM50247109
Synonyms:
(3S,4aR,6aR,6bR,8aR,12aS,12bR,14aR,14bR)-4,4,6a,6b,8a,11,11,14b-octamethyldocosahydropicen-3-ol | CHEMBL516988
Type:
Small organic molecule
Emp. Form.:
C30H52O
Mol. Mass.:
428.7333
SMILES:
CC1(C)CC[C@]2(C)CC[C@]3(C)[C@H](CC[C@@H]4[C@@]5(C)CC[C@H](O)C(C)(C)[C@@H]5CC[C@@]34C)[C@@H]2C1
: