Target
Cannabinoid receptor 1
Ligand
BDBM50253757
Substrate
Meas. Tech.
ChEMBL_510960 (CHEMBL1003147)
IC50
3±n/a nM
Citation
 Tseng, SLHung, MSChang, CPSong, JSTai, CLChiu, HHHsieh, WPLin, YChung, WLKuo, CWWu, CHChu, CMTung, YSChao, YSShia, KS Bioisosteric replacement of the pyrazole 5-aryl moiety of N-(piperidin-1-yl)-5-(4-chlorophenyl)-1-(2,4-dichlorophenyl)-4-methyl-1H-pyrazole-3-carboxamide (SR141716A). A novel series of alkynylthiophenes as potent and selective cannabinoid-1 receptor antagonists. J Med Chem 51:5397-412 (2008)  
Target
Name:
Cannabinoid receptor 1
Synonyms:
CANN6 CB-R CNR CNR1_HUMAN Cannabinoid receptor Cannabinoid receptor 1 (brain)
Type:
G Protein-Coupled Receptor (GPCR)
Mol. Mass.:
52868.96
Organism:
Homo sapiens (Human)
Description:
P21554
Residue:
472
  
Inhibitor
Name:
BDBM50253757
Synonyms:
CHEMBL462069 | N-Butyl-1-(2,4-dichlorophenyl)-5-(5-(hex-1-ynyl)thiophen-2-yl)-4-methyl-1H-pyrazole-3-carboxamide
Type:
Small organic molecule
Emp. Form.:
C25H27Cl2N3OS
Mol. Mass.:
488.472
SMILES:
CCCCNC(=O)c1nn(c(c1C)-c1ccc(s1)C#CCCCC)-c1ccc(Cl)cc1Cl
: