Target
Xanthine dehydrogenase/oxidase
Ligand
BDBM50209568
Substrate
Meas. Tech.
ChEMBL_535180 (CHEMBL991725)
IC50
6600±n/a nM
Citation
 Park, JSPark, HYKim, DHKim, DHKim, HK ortho-dihydroxyisoflavone derivatives from aged Doenjang (Korean fermented soypaste) and its radical scavenging activity. Bioorg Med Chem Lett 18:5006-9 (2008)  
Target
Name:
Xanthine dehydrogenase/oxidase
Synonyms:
XD XDHA XO Xanthine dehydrogenase/oxidase | Xanthine oxidase
Type:
Enzyme
Mol. Mass.:
146441.21
Organism:
Homo sapiens (Human)
Description:
P47989
Residue:
1333
  
Inhibitor
Name:
BDBM50209568
Synonyms:
4',7,8-trihydroxyisoflavone 7,8-dihydroxy-3-(4-hydroxyphenyl)-4H-chromen-4-one IR-301
Type:
Small organic molecule
Emp. Form.:
C15H10O5
Mol. Mass.:
270.2369
SMILES:
Oc1ccc(cc1)-c1coc2c(O)c(O)ccc2c1=O
: