Target
Xanthine dehydrogenase/oxidase
Ligand
BDBM50095997
Substrate
Meas. Tech.
ChEMBL_535180 (CHEMBL991725)
IC50
16800±n/a nM
Citation
 Park, JSPark, HYKim, DHKim, DHKim, HK ortho-dihydroxyisoflavone derivatives from aged Doenjang (Korean fermented soypaste) and its radical scavenging activity. Bioorg Med Chem Lett 18:5006-9 (2008)  
Target
Name:
Xanthine dehydrogenase/oxidase
Synonyms:
XD XDHA XO Xanthine dehydrogenase/oxidase | Xanthine oxidase
Type:
Enzyme
Mol. Mass.:
146441.21
Organism:
Homo sapiens (Human)
Description:
P47989
Residue:
1333
  
Inhibitor
Name:
BDBM50095997
Synonyms:
3',4',7-trihydroxyisoflavone | CHEMBL13486
Type:
Small organic molecule
Emp. Form.:
C15H10O5
Mol. Mass.:
270.2369
SMILES:
Oc1ccc2c(c1)occ(-c1ccc(O)c(O)c1)c2=O
: