Target
Adenosine receptor A2a
Ligand
BDBM50264554
Substrate
Meas. Tech.
ChEMBL_535232 (CHEMBL991729)
Ki
4.46±n/a nM
Citation
 Pretorius, JMalan, SFCastagnoli, NBergh, JJPetzer, JP Dual inhibition of monoamine oxidase B and antagonism of the adenosine A(2A) receptor by (E,E)-8-(4-phenylbutadien-1-yl)caffeine analogues. Bioorg Med Chem 16:8676-84 (2008)  
Target
Name:
Adenosine receptor A2a
Synonyms:
AA2AR_RAT Adenosine A2 receptor Adenosine Receptors A2a (A2a) Adenosine receptors A2a Rat striatal adenosine A2a receptor
Type:
G Protein-Coupled Receptor (GPCR)
Mol. Mass.:
45015.65
Organism:
Rattus norvegicus (rat)
Description:
Rat A2A receptors expressed in CHO cells.
Residue:
410
  
Inhibitor
Name:
BDBM50264554
Synonyms:
(E)-1,3-diethyl-8-(3,4-dimethoxystyryl)-7-methylxanthine KW-6002
Type:
Small organic molecule
Emp. Form.:
C20H26N4O4
Mol. Mass.:
386.4448
SMILES:
CCN1C2N=C(C=Cc3ccc(OC)c(OC)c3)N(C)C2C(=O)N(CC)C1=O
: