Target
Glycogen phosphorylase, liver form
Ligand
BDBM50246785
Substrate
Meas. Tech.
ChEMBL_557776 (CHEMBL953285)
IC50
12±n/a nM
Citation
 Onda, KShiraki, RYonetoku, YMomose, KKatayama, NOrita, MYamaguchi, TOhta, MTsukamoto, S Synthesis and pharmacological evaluation of bis-3-(3,4-dichlorophenyl)acrylamide derivatives as glycogen phosphorylase inhibitors. Bioorg Med Chem 16:8627-34 (2008)  
Target
Name:
Glycogen phosphorylase, liver form
Synonyms:
Glycogen Phosphorylase (PYGL) Liver glycogen phosphorylase PYGL_HUMAN
Type:
Homodimer
Mol. Mass.:
97153.98
Organism:
Homo sapiens (Human)
Description:
Dimers associate into a tetramer to form the enzymatically active phosphorylase A.
Residue:
847
  
Inhibitor
Name:
BDBM50246785
Synonyms:
(2E,2'E)-N,N'-(Thiodiethane-2,1-diyl)bis[3-(3,4-dichlorophenyl) acrylamide] | CHEMBL488273
Type:
Small organic molecule
Emp. Form.:
C22H20Cl4N2O2S
Mol. Mass.:
518.283
SMILES:
Clc1ccc(\C=C\C(=O)NCCSCCNC(=O)\C=C\c2ccc(Cl)c(Cl)c2)cc1Cl
: