Target
Integrin alpha-IIb
Ligand
BDBM50253718
Substrate
Meas. Tech.
ChEMBL_511534 (CHEMBL980977)
IC50
28400±n/a nM
Citation
 Ilas, JJakopin, ZBorstnar, TStegnar, MKikelj, D 3,4-Dihydro-2H-1,4-benzoxazine derivatives combining thrombin inhibitory and glycoprotein IIb/IIIa receptor antagonistic activity as a novel class of antithrombotic compounds with dual function. J Med Chem 51:5617-29 (2008)  
Target
Name:
Integrin alpha-IIb
Synonyms:
CD_antigen=CD41 GPIIb Glycoprotein IIb ITGA2B Integrin alpha-IIb heavy chain Integrin alpha-IIb light chain, form 2 Integrin alpha-V/beta-3 and alpha-IIb/beta 3 | Platelet membrane glycoprotein IIb
Type:
Protein
Mol. Mass.:
113354.85
Organism:
Homo sapiens (Human)
Description:
P08514
Residue:
1039
  
Inhibitor
Name:
BDBM50253718
Synonyms:
CHEMBL461192 | Ethyl 2-[2-(4-carbamimidoylbenzyloxy)-4-methyl-3-oxo-N-phenyl-3,4-dihydro-2H-1,4-benzoxazine-7-carbonylamino]acetate
Type:
Small organic molecule
Emp. Form.:
C28H28N4O6
Mol. Mass.:
516.5451
SMILES:
CCOC(=O)CN(C(=O)c1ccc2N(C)C(=O)C(OCc3ccc(cc3)C(N)=N)Oc2c1)c1ccccc1
: