Target
Integrin alpha-IIb
Ligand
BDBM50253779
Substrate
Meas. Tech.
ChEMBL_511534 (CHEMBL980977)
IC50
15200±n/a nM
Citation
 Ilas, JJakopin, ZBorstnar, TStegnar, MKikelj, D 3,4-Dihydro-2H-1,4-benzoxazine derivatives combining thrombin inhibitory and glycoprotein IIb/IIIa receptor antagonistic activity as a novel class of antithrombotic compounds with dual function. J Med Chem 51:5617-29 (2008)  
Target
Name:
Integrin alpha-IIb
Synonyms:
CD_antigen=CD41 GPIIb Glycoprotein IIb ITGA2B Integrin alpha-IIb heavy chain Integrin alpha-IIb light chain, form 2 Integrin alpha-V/beta-3 and alpha-IIb/beta 3 | Platelet membrane glycoprotein IIb
Type:
Protein
Mol. Mass.:
113354.85
Organism:
Homo sapiens (Human)
Description:
P08514
Residue:
1039
  
Inhibitor
Name:
BDBM50253779
Synonyms:
3-[2-(4-Carbamimidoylbenzyloxy)-4-methyl-3-oxo-3,4-dihydro-2H-1,4-benzoxazine-7-carbonylamino]propanoic acid | CHEMBL460567
Type:
Small organic molecule
Emp. Form.:
C21H22N4O6
Mol. Mass.:
426.4226
SMILES:
CN1C(=O)C(OCc2ccc(cc2)C(N)=N)Oc2cc(ccc12)C(=O)NCCC(O)=O
: