Target
Peroxisome proliferator-activated receptor gamma
Ligand
BDBM50049240
Substrate
Meas. Tech.
ChEMBL_496449 (CHEMBL1004580)
IC50
700±n/a nM
Citation
 Sundriyal, SViswanad, BRamarao, PChakraborti, AKBharatam, PV New PPARgamma ligands based on barbituric acid: virtual screening, synthesis and receptor binding studies. Bioorg Med Chem Lett 18:4959-62 (2008)  
Target
Name:
Peroxisome proliferator-activated receptor gamma
Synonyms:
Nr1c3 PPAR-gamma Pparg
Type:
PROTEIN
Mol. Mass.:
57593.55
Organism:
Mus musculus
Description:
ChEMBL_1453700
Residue:
505
  
Inhibitor
Name:
BDBM50049240
Synonyms:
(+-)-5-((4-(2-(5-ethyl-2-pyridinyl)ethoxy)phenyl)methyl)-2,4-thiazolidinedione CHEMBL595 PIOGLITAZONE HYDROCHLORIDE
Type:
Small organic molecule
Emp. Form.:
C19H20N2O3S
Mol. Mass.:
356.439
SMILES:
CCc1ccc(CCOc2ccc(Cc3sc(=O)[nH]c3O)cc2)nc1
: