Target
B1 bradykinin receptor
Ligand
BDBM50264298
Substrate
Meas. Tech.
ChEMBL_535281 (CHEMBL982606)
IC50
155±n/a nM
Citation
 Guo, QChandrasekhar, JIhle, DWustrow, DJChenard, BLKrause, JEHutchison, AAlderman, DCheng, CCortright, DBroom, DKershaw, MTSimmermacher-Mayer, JPeng, YHodgetts, KJ 1-Benzylbenzimidazoles: the discovery of a novel series of bradykinin B(1) receptor antagonists. Bioorg Med Chem Lett 18:5027-31 (2008)  
Target
Name:
B1 bradykinin receptor
Synonyms:
B1 BRADYKININ B1bkr BKRB1_RAT Bkr KB1 | Kinin B1 receptor
Type:
Enzyme Catalytic Domain
Mol. Mass.:
38389.97
Organism:
RAT
Description:
B1 BRADYKININ BDKRB1 RAT::P97583
Residue:
337
  
Inhibitor
Name:
BDBM50264298
Synonyms:
CHEMBL490201 | N-(2-((4-(4,5-dihydro-1H-imidazol-2-yl)benzyl)(methyl)amino)-2-oxoethyl)-1-benzyl-1H-benzo[d]imidazole-2-carboxamide
Type:
Small organic molecule
Emp. Form.:
C28H28N6O2
Mol. Mass.:
480.5609
SMILES:
CN(Cc1ccc(cc1)C1=NCCN1)C(=O)CNC(=O)c1nc2ccccc2n1Cc1ccccc1
: