Target
Sodium- and chloride-dependent glycine transporter 1
Ligand
BDBM50265274
Substrate
Meas. Tech.
ChEMBL_496465 (CHEMBL1007112)
EC50
2±n/a nM
Citation
 Pinard, EAlberati, DBorroni, EFischer, HHainzl, DJolidon, SMoreau, JLNarquizian, RNettekoven, MNorcross, RDStalder, HThomas, AW Discovery of benzoylpiperazines as a novel class of potent and selective GlyT1 inhibitors. Bioorg Med Chem Lett 18:5134-9 (2008)  
Target
Name:
Sodium- and chloride-dependent glycine transporter 1
Synonyms:
GlyT-1 Glycine Transporters (GlyT1c) SC6A9_HUMAN Sodium- and chloride-dependent glycine transporter 1 Sodium- and chloride-dependent glycine transporter 1 (GlyT1c) Solute carrier family 6 member 9
Type:
Enzyme
Mol. Mass.:
78270.54
Organism:
Homo sapiens (Human)
Description:
P48067
Residue:
706
  
Inhibitor
Name:
BDBM50265274
Synonyms:
1-(3-fluoro-4-(4-(2-(isopropylamino)-5-nitrobenzoyl)piperazin-1-yl)phenyl)ethanone | CHEMBL498384
Type:
Small organic molecule
Emp. Form.:
C22H25FN4O4
Mol. Mass.:
428.4567
SMILES:
CC(C)Nc1ccc(cc1C(=O)N1CCN(CC1)c1ccc(cc1F)C(C)=O)[N+]([O-])=O
: