Target
Neuronal acetylcholine receptor subunit alpha-7
Ligand
BDBM50253824
Substrate
Meas. Tech.
ChEMBL_512491 (CHEMBL966981)
IC50
79±n/a nM
Citation
 Jin, AHDaly, NLNevin, STWang, CIDutertre, SLewis, RJAdams, DJCraik, DJAlewood, PF Molecular engineering of conotoxins: the importance of loop size to alpha-conotoxin structure and function. J Med Chem 51:5575-84 (2008)  
Target
Name:
Neuronal acetylcholine receptor subunit alpha-7
Synonyms:
ACHA7_RAT Cholinergic, Nicotinic Alpha7 Chrna7 Neuronal acetylcholine receptor (alpha7 nAChR) Neuronal acetylcholine receptor subunit alpha-7 Neuronal acetylcholine receptor subunit alpha-7 (nAChR)
Type:
Enzyme
Mol. Mass.:
56502.44
Organism:
Rattus norvegicus (Rat)
Description:
Q05941
Residue:
502
  
Inhibitor
Name:
BDBM50253824
Synonyms:
(1R,6R,9S,15S,18S,21S,24S,27R,30S,36S,42S,45S,50R)-50-(2-aminoacetamido)-15,18-bis(carbamoylmethyl)-45-(hydroxymethyl)-24-methyl-21,42-bis(2-methylpropyl)-8,14,17,20,23,26,29,35,41,44,47,49-dodecaoxo-3,4,52,53-tetrathia-7,13,16,19,22,25,28,34,40,43,46,48-dodecaazapentacyclo[25.20.7.0^{9,13}.0^{30,34}.0^{36,40}]tetrapentacontane-6-carboxylic acid | CHEMBL500367
Type:
Small organic molecule
Emp. Form.:
C55H86N16O18S4
Mol. Mass.:
1387.628
SMILES:
CC(C)C[C@@H]1NC(=O)[C@H](C)NC(=O)[C@@H]2CSSC[C@H](NC(=O)CN)C(=O)N[C@@H](CSSC[C@H](NC(=O)[C@@H]3CCCN3C(=O)[C@H](CC(N)=O)NC(=O)[C@H](CC(N)=O)NC1=O)C(O)=O)C(=O)N[C@@H](CO)C(=O)N[C@@H](CC(C)C)C(=O)N1CCC[C@H]1C(=O)N1CCC[C@H]1C(=O)N2
: