Target
Sodium/glucose cotransporter 2
Ligand
BDBM50265221
Substrate
Meas. Tech.
ChEMBL_496716 (CHEMBL1005353)
IC50
420±n/a nM
Citation
 Lansdell, MIBurring, DJHepworth, DStrawbridge, MGraham, EGuyot, TBetson, MSHart, JD Design and synthesis of fluorescent SGLT2 inhibitors. Bioorg Med Chem Lett 18:4944-7 (2008)  
Target
Name:
Sodium/glucose cotransporter 2
Synonyms:
Na(+)/glucose cotransporter 2 SGLT2 Sodium-Dependent Glucose Cotransporter 2 (SGLT2) Solute carrier family 5 member 2
Type:
Protein
Mol. Mass.:
72902.00
Organism:
Homo sapiens (Human)
Description:
P31639
Residue:
672
  
Inhibitor
Name:
BDBM50265221
Synonyms:
3-(3-(2-(4-(2-chloro-5-((2S,3R,4R,5S,6R)-3,4,5-trihydroxy-6-(hydroxymethyl)tetrahydro-2H-pyran-2-yl)benzyl)phenoxy)ethylamino)-3-oxopropyl)-5,5-difluoro-7,9-dimethyl-5H-dipyrrolo[1,2-c:1',2'-f][1,3,2]diazaborinin-4-ium-5-uide | CHEMBL442864
Type:
Small organic molecule
Emp. Form.:
C35H39BClF2N3O7
Mol. Mass.:
697.961
SMILES:
Cc1cc(C)n2c1C=C1C=CC(CCC(=O)NCCOc3ccc(Cc4cc(ccc4Cl)[C@@H]4O[C@H](CO)[C@@H](O)[C@H](O)[C@H]4O)cc3)=[N+]1[B-]2(F)F
: